Target
Plasma kallikrein
Ligand
BDBM50096792
Substrate
Meas. Tech.
ChEMBL_1499036 (CHEMBL3584633)
Ki
7.0±n/a nM
Citation
 Hu, ZWong, PCGilligan, PJHan, WPabbisetty, KBBozarth, JMCrain, EJHarper, TLuettgen, JMMyers, JERamamurthy, VRossi, KASheriff, SWatson, CAWei, AZheng, JJSeiffert, DAWexler, RRQuan, ML Discovery of a Potent Parenterally Administered Factor XIa Inhibitor with Hydroxyquinolin-2(1H)-one as the P2' Moiety. ACS Med Chem Lett 6:590-5 (2015)  
Target
Name:
Plasma kallikrein
Synonyms:
Fletcher factor KLKB1 Kallikrein Plasma kallikrein heavy chain Plasma prekallikrein
Type:
Protein
Mol. Mass.:
71391.16
Organism:
Homo sapiens (Human)
Description:
P03952
Residue:
638
  
Inhibitor
Name:
BDBM50096792
Synonyms:
CHEMBL3580759
Type:
Small organic molecule
Emp. Form.:
C30H28Cl2N10O4
Mol. Mass.:
663.514
SMILES:
CN1CCN(CC1)C(=O)C[C@H](NC(=O)\C=C\c1cc(Cl)ccc1-n1cnnn1)c1nc(c(Cl)[nH]1)-c1ccc2[nH]c(=O)cc(O)c2c1
: