Target
Coagulation factor XI
Ligand
BDBM50096842
Substrate
Meas. Tech.
ChEMBL_1499026 (CHEMBL3584521)
Ki
0.700000±n/a nM
Citation
 Hu, ZWong, PCGilligan, PJHan, WPabbisetty, KBBozarth, JMCrain, EJHarper, TLuettgen, JMMyers, JERamamurthy, VRossi, KASheriff, SWatson, CAWei, AZheng, JJSeiffert, DAWexler, RRQuan, ML Discovery of a Potent Parenterally Administered Factor XIa Inhibitor with Hydroxyquinolin-2(1H)-one as the P2' Moiety. ACS Med Chem Lett 6:590-5 (2015)  
Target
Name:
Coagulation factor XI
Synonyms:
Coagulation factor XIa Coagulation factor XIa light chain FA11_HUMAN Factor XIa PTA | Plasma thromboplastin antecedent
Type:
Enzyme
Mol. Mass.:
70130.58
Organism:
Homo sapiens (Human)
Description:
P03951
Residue:
625
  
Inhibitor
Name:
BDBM50096842
Synonyms:
CHEMBL3580755
Type:
Small organic molecule
Emp. Form.:
C28H27Cl2N9O5
Mol. Mass.:
640.477
SMILES:
COC(=O)Nc1ccc(cc1)-c1nc([nH]c1Cl)[C@H](CC(=O)N1CCOCC1)NC(=O)\C=C\c1cc(Cl)ccc1-n1cnnn1
: