Target
Coagulation factor XI
Ligand
BDBM50096792
Substrate
Meas. Tech.
ChEMBL_1499047 (CHEMBL3584644)
Ki
0.100000±n/a nM
Citation
 Hu, ZWong, PCGilligan, PJHan, WPabbisetty, KBBozarth, JMCrain, EJHarper, TLuettgen, JMMyers, JERamamurthy, VRossi, KASheriff, SWatson, CAWei, AZheng, JJSeiffert, DAWexler, RRQuan, ML Discovery of a Potent Parenterally Administered Factor XIa Inhibitor with Hydroxyquinolin-2(1H)-one as the P2' Moiety. ACS Med Chem Lett 6:590-5 (2015)  
Target
Name:
Coagulation factor XI
Synonyms:
Coagulation factor XIa Coagulation factor XIa light chain FA11_HUMAN Factor XIa PTA | Plasma thromboplastin antecedent
Type:
Enzyme
Mol. Mass.:
70130.58
Organism:
Homo sapiens (Human)
Description:
P03951
Residue:
625
  
Inhibitor
Name:
BDBM50096792
Synonyms:
CHEMBL3580759
Type:
Small organic molecule
Emp. Form.:
C30H28Cl2N10O4
Mol. Mass.:
663.514
SMILES:
CN1CCN(CC1)C(=O)C[C@H](NC(=O)\C=C\c1cc(Cl)ccc1-n1cnnn1)c1nc(c(Cl)[nH]1)-c1ccc2[nH]c(=O)cc(O)c2c1
: