Target
Serine/threonine-protein kinase PAK 4
Ligand
BDBM50097133
Substrate
Meas. Tech.
ChEMBL_1499558 (CHEMBL3584416)
Ki
42±n/a nM
Citation
 Crawford, JJLee, WAliagas, IMathieu, SHoeflich, KPZhou, WWang, WRouge, LMurray, LLa, HLiu, NFan, PWCheong, JHeise, CERamaswamy, SMintzer, RLiu, YChao, QRudolph, J Structure-Guided Design of Group I Selective p21-Activated Kinase Inhibitors. J Med Chem 58:5121-36 (2015)  
Target
Name:
Serine/threonine-protein kinase PAK 4
Synonyms:
KIAA1142 PAK4_HUMAN | p21-Activated kinase 4 (PAK4)
Type:
Protein
Mol. Mass.:
64098.01
Organism:
Homo sapiens (Human)
Description:
O96013
Residue:
591
  
Inhibitor
Name:
BDBM50097133
Synonyms:
CHEMBL3580968
Type:
Small organic molecule
Emp. Form.:
C20H21N7
Mol. Mass.:
359.4276
SMILES:
C[C@H](Nc1nccc(Nc2cc([nH]n2)C2CC2)n1)c1ccc2[nH]ccc2c1
: