Target
Serine/threonine-protein kinase PAK 1
Ligand
BDBM50097146
Substrate
Meas. Tech.
ChEMBL_1499557 (CHEMBL3584415)
Ki
245±n/a nM
Citation
 Crawford, JJLee, WAliagas, IMathieu, SHoeflich, KPZhou, WWang, WRouge, LMurray, LLa, HLiu, NFan, PWCheong, JHeise, CERamaswamy, SMintzer, RLiu, YChao, QRudolph, J Structure-Guided Design of Group I Selective p21-Activated Kinase Inhibitors. J Med Chem 58:5121-36 (2015)  
Target
Name:
Serine/threonine-protein kinase PAK 1
Synonyms:
2.7.11.1 Cell division control protein 42 homolog PAK-1 PAK1_HUMAN p21-activated kinase 1 | p65-PAK
Type:
Mol. Mass.:
60640.15
Organism:
Homo sapiens (Human)
Description:
Q13153
Residue:
545
  
Inhibitor
Name:
BDBM50097146
Synonyms:
CHEMBL3580960
Type:
Small organic molecule
Emp. Form.:
C16H23N7
Mol. Mass.:
313.4007
SMILES:
C(Nc1nccc(Nc2cc([nH]n2)C2CC2)n1)C1CCNCC1
: