Target
Tyrosine-protein kinase BTK
Ligand
BDBM50097394
Substrate
Meas. Tech.
ChEMBL_1501897 (CHEMBL3588237)
EC50
92±n/a nM
Citation
 Smith, CRDougan, DRKomandla, MKanouni, TKnight, BLawson, JDSabat, MTaylor, ERVu, PWyrick, C Fragment-Based Discovery of a Small Molecule Inhibitor of Bruton's Tyrosine Kinase. J Med Chem 58:5437-44 (2015)  
Target
Name:
Tyrosine-protein kinase BTK
Synonyms:
AGMX1 Agammaglobulinaemia tyrosine kinase B cell progenitor kinase BPK BTK_HUMAN Tyrosine Kinase BTK Tyrosine-protein kinase BTK (BTK)
Type:
Enzyme
Mol. Mass.:
76289.95
Organism:
Homo sapiens (Human)
Description:
Q06187
Residue:
659
  
Inhibitor
Name:
BDBM50097394
Synonyms:
CHEMBL3586446
Type:
Small organic molecule
Emp. Form.:
C16H12N6O
Mol. Mass.:
304.3061
SMILES:
NC(=O)c1nnc2c(cccc2c1N)-c1ccc2cn[nH]c2c1
: