Target
Cytoplasmic tyrosine-protein kinase BMX
Ligand
BDBM50097393
Substrate
Meas. Tech.
ChEMBL_1501936 (CHEMBL3588276)
IC50
36±n/a nM
Citation
 Smith, CRDougan, DRKomandla, MKanouni, TKnight, BLawson, JDSabat, MTaylor, ERVu, PWyrick, C Fragment-Based Discovery of a Small Molecule Inhibitor of Bruton's Tyrosine Kinase. J Med Chem 58:5437-44 (2015)  
Target
Name:
Cytoplasmic tyrosine-protein kinase BMX
Synonyms:
BMX BMX_HUMAN Cytoplasmic tyrosine-protein kinase BMX (BMX) Epithelial and endothelial tyrosine kinase Tyrosine Kinase BMX | Tyrosine-protein kinase BMX/ETK
Type:
Tyrosine-protein kinase
Mol. Mass.:
78030.42
Organism:
Homo sapiens (Human)
Description:
P51813
Residue:
675
  
Inhibitor
Name:
BDBM50097393
Synonyms:
CHEMBL3586447
Type:
Small organic molecule
Emp. Form.:
C17H14N6O
Mol. Mass.:
318.3327
SMILES:
Cc1cc2cn[nH]c2cc1-c1cccc2c(N)c(nnc12)C(N)=O
: