Target
cAMP-specific 3',5'-cyclic phosphodiesterase 4D
Ligand
BDBM50097486
Substrate
Meas. Tech.
ChEMBL_1501584 (CHEMBL3587234)
IC50
1120±n/a nM
Citation
 Brullo, CMassa, MVilla, CRicciarelli, RRivera, DPronzato, MAFedele, EBarocelli, EBertoni, SFlammini, LBruno, O Synthesis, biological activities and pharmacokinetic properties of new fluorinated derivatives of selective PDE4D inhibitors. Bioorg Med Chem 23:3426-35 (2015)  
Target
Name:
cAMP-specific 3',5'-cyclic phosphodiesterase 4D
Synonyms:
3',5'-cyclic phosphodiesterase PDE43 PDE4D_HUMAN | Phosphodiesterase 4D
Type:
Protein
Mol. Mass.:
91092.69
Organism:
Homo sapiens (Human)
Description:
Q08499
Residue:
809
  
Inhibitor
Name:
BDBM50097486
Synonyms:
CHEMBL3585873
Type:
Small organic molecule
Emp. Form.:
C19H24F2N2O5
Mol. Mass.:
398.4011
SMILES:
FC(F)Oc1ccc(\C=N\OCC(=O)N2CCOCC2)cc1OC1CCCC1
: