Target
Dual specificity tyrosine-phosphorylation-regulated kinase 1B
Ligand
BDBM50097869
Substrate
Meas. Tech.
ChEMBL_1502249 (CHEMBL3591328)
IC50
600±n/a nM
Citation
 Falke, HChaikuad, ABecker, ALoaëc, NLozach, OAbu Jhaisha, SBecker, WJones, PGPreu, LBaumann, KKnapp, SMeijer, LKunick, C 10-iodo-11H-indolo[3,2-c]quinoline-6-carboxylic acids are selective inhibitors of DYRK1A. J Med Chem 58:3131-43 (2015)  
Target
Name:
Dual specificity tyrosine-phosphorylation-regulated kinase 1B
Synonyms:
DYR1B_HUMAN Dual specificity tyrosine-phosphorylation-regulated kinase 1B MIRK
Type:
Enzyme
Mol. Mass.:
69222.24
Organism:
Homo sapiens (Human)
Description:
Q9Y463
Residue:
629
  
Inhibitor
Name:
BDBM50097869
Synonyms:
CHEMBL3589662
Type:
Small organic molecule
Emp. Form.:
C16H9IN2O2
Mol. Mass.:
388.1593
SMILES:
OC(=O)c1nc2ccccc2c2[nH]c3c(I)cccc3c12
: