Target
Dual specificity tyrosine-phosphorylation-regulated kinase 1B
Ligand
BDBM50097870
Substrate
Meas. Tech.
ChEMBL_1502249 (CHEMBL3591328)
IC50
3000±n/a nM
Citation
 Falke, HChaikuad, ABecker, ALoaëc, NLozach, OAbu Jhaisha, SBecker, WJones, PGPreu, LBaumann, KKnapp, SMeijer, LKunick, C 10-iodo-11H-indolo[3,2-c]quinoline-6-carboxylic acids are selective inhibitors of DYRK1A. J Med Chem 58:3131-43 (2015)  
Target
Name:
Dual specificity tyrosine-phosphorylation-regulated kinase 1B
Synonyms:
DYR1B_HUMAN Dual specificity tyrosine-phosphorylation-regulated kinase 1B MIRK
Type:
Enzyme
Mol. Mass.:
69222.24
Organism:
Homo sapiens (Human)
Description:
Q9Y463
Residue:
629
  
Inhibitor
Name:
BDBM50097870
Synonyms:
CHEMBL3589664
Type:
Small organic molecule
Emp. Form.:
C17H11FN2O3
Mol. Mass.:
310.2792
SMILES:
COc1ccc2c3[nH]c4c(F)cccc4c3c(nc2c1)C(O)=O
: