Target
Cyclin-dependent kinase 9
Ligand
BDBM50097859
Substrate
Meas. Tech.
ChEMBL_1502244 (CHEMBL3591180)
IC50
>10000±n/a nM
Citation
 Falke, HChaikuad, ABecker, ALoaëc, NLozach, OAbu Jhaisha, SBecker, WJones, PGPreu, LBaumann, KKnapp, SMeijer, LKunick, C 10-iodo-11H-indolo[3,2-c]quinoline-6-carboxylic acids are selective inhibitors of DYRK1A. J Med Chem 58:3131-43 (2015)  
Target
Name:
Cyclin-dependent kinase 9
Synonyms:
C-2K CDK9 Cell division cycle 2-like protein kinase 4 Cyclin-Dependent Kinase 9 (CDK9) Serine/threonine-protein kinase PITALRE Tat-associated kinase complex catalytic subunit
Type:
Enzyme Subunit
Mol. Mass.:
42789.13
Organism:
Homo sapiens (Human)
Description:
Residue:
372
  
Inhibitor
Name:
BDBM50097859
Synonyms:
CHEMBL3589670
Type:
Small organic molecule
Emp. Form.:
C16H8FIN2O2
Mol. Mass.:
406.1498
SMILES:
OC(=O)c1nc2ccc(I)cc2c2[nH]c3c(F)cccc3c12
: