Target
ATPase family AAA domain-containing protein 2
Ligand
BDBM50098254
Substrate
Meas. Tech.
ChEMBL_1502811 (CHEMBL3591371)
IC50
200±n/a nM
Citation
 Bamborough, PChung, CWFurze, RCGrandi, PMichon, AMSheppard, RJBarnett, HDiallo, HDixon, DPDouault, CJones, EJKaramshi, BMitchell, DJPrinjha, RKRau, CWatson, RJWerner, TDemont, EH Structure-Based Optimization of Naphthyridones into Potent ATAD2 Bromodomain Inhibitors. J Med Chem 58:6151-78 (2015)  
Target
Name:
ATPase family AAA domain-containing protein 2
Synonyms:
AAA nuclear coregulator cancer-associated protein ATAD2 PRO2000
Type:
PROTEIN
Mol. Mass.:
158546.30
Organism:
Homo sapiens (Human)
Description:
ChEMBL_1500426
Residue:
1390
  
Inhibitor
Name:
BDBM50098254
Synonyms:
CHEMBL3590380
Type:
Small organic molecule
Emp. Form.:
C25H31N5O3
Mol. Mass.:
449.5453
SMILES:
Cc1cc2c(cnc(N[C@@H]3CCNC[C@H]3OCC3CCOCC3)c2[nH]c1=O)-c1cccnc1
: