Target
Bromodomain-containing protein 1
Ligand
BDBM50098311
Substrate
Meas. Tech.
ChEMBL_1502820 (CHEMBL3591380)
Ki
398±n/a nM
Citation
 Bamborough, PChung, CWFurze, RCGrandi, PMichon, AMSheppard, RJBarnett, HDiallo, HDixon, DPDouault, CJones, EJKaramshi, BMitchell, DJPrinjha, RKRau, CWatson, RJWerner, TDemont, EH Structure-Based Optimization of Naphthyridones into Potent ATAD2 Bromodomain Inhibitors. J Med Chem 58:6151-78 (2015)  
Target
Name:
Bromodomain-containing protein 1
Synonyms:
BR140-like protein BRD1_HUMAN BRL Bromodomain and PHD finger-containing protein 2 | Bromodomain-containing protein 1
Type:
PROTEIN
Mol. Mass.:
119557.65
Organism:
Homo sapiens (Human)
Description:
ChEMBL_105349
Residue:
1058
  
Inhibitor
Name:
BDBM50098311
Synonyms:
CHEMBL3590408
Type:
Small organic molecule
Emp. Form.:
C27H35N5O4S
Mol. Mass.:
525.663
SMILES:
CN1CC[C@@H](Nc2ncc(-c3cncc(C)c3)c3cc(C)c(=O)[nH]c23)[C@@H](C1)OCC1CCS(=O)(=O)CC1
: