Target
Carbonic anhydrase 1
Ligand
BDBM50098364
Substrate
Meas. Tech.
ChEMBL_1505005 (CHEMBL3595787)
Ki
258±n/a nM
Citation
 Ibrahim, DALasheen, DSZaky, MYIbrahim, AWVullo, DCeruso, MSupuran, CTAbou El Ella, DA Design and synthesis of benzothiazole-6-sulfonamides acting as highly potent inhibitors of carbonic anhydrase isoforms I, II, IX and XII. Bioorg Med Chem 23:4989-99 (2015)  
Target
Name:
Carbonic anhydrase 1
Synonyms:
CA-I CAB Carbonate dehydratase I Carbonic anhydrase 1 (CA I) Carbonic anhydrase 1 (Recombinant CA I) Carbonic anhydrase B Carbonic anhydrase I (CA I) Carbonic anhydrase I (CAI) Carbonic anhydrase isoenzyme I (hCA I) | hCA
Type:
Enzyme
Mol. Mass.:
28873.37
Organism:
Homo sapiens (Human)
Description:
P00915
Residue:
261
  
Inhibitor
Name:
BDBM50098364
Synonyms:
CHEMBL3594409
Type:
Small organic molecule
Emp. Form.:
C18H15Cl2N7O4S3
Mol. Mass.:
560.457
SMILES:
Nn1c(COc2ccc(Cl)cc2Cl)nnc1SCC(=O)Nc1nc2ccc(cc2s1)S(N)(=O)=O
: