Target
Carbonic anhydrase 9
Ligand
BDBM50098357
Substrate
Meas. Tech.
ChEMBL_1505007 (CHEMBL3595789)
Ki
4.3±n/a nM
Citation
 Ibrahim, DALasheen, DSZaky, MYIbrahim, AWVullo, DCeruso, MSupuran, CTAbou El Ella, DA Design and synthesis of benzothiazole-6-sulfonamides acting as highly potent inhibitors of carbonic anhydrase isoforms I, II, IX and XII. Bioorg Med Chem 23:4989-99 (2015)  
Target
Name:
Carbonic anhydrase 9
Synonyms:
CA-IX CAH9_HUMAN Carbonic anhydrase 9 (CA IX) Carbonic anhydrase 9 precursor Carbonic anhydrase IX (CAIX) Carbonic anhydrases; II & IX MN RCC-associated antigen G250
Type:
Enzyme
Mol. Mass.:
49669.03
Organism:
Homo sapiens (Human)
Description:
Catalytic domain of human cloned isozyme was used in the assay
Residue:
459
  
Inhibitor
Name:
BDBM50098357
Synonyms:
CHEMBL3594416
Type:
Small organic molecule
Emp. Form.:
C15H13N7O4S3
Mol. Mass.:
451.503
SMILES:
CSc1nn(CC(=O)Nc2nc3ccc(cc3s2)S(N)(=O)=O)c2nc[nH]c(=O)c12
: