Target
Carbonic anhydrase 12
Ligand
BDBM50098350
Substrate
Meas. Tech.
ChEMBL_1505008 (CHEMBL3595790)
Ki
4.8±n/a nM
Citation
 Ibrahim, DALasheen, DSZaky, MYIbrahim, AWVullo, DCeruso, MSupuran, CTAbou El Ella, DA Design and synthesis of benzothiazole-6-sulfonamides acting as highly potent inhibitors of carbonic anhydrase isoforms I, II, IX and XII. Bioorg Med Chem 23:4989-99 (2015)  
Target
Name:
Carbonic anhydrase 12
Synonyms:
CA-XII CAH12_HUMAN Carbonic anhydrase Carbonic anhydrase XII Carbonic anhydrase XII (CAXII) | Tumor antigen HOM-RCC-3.1.3
Type:
Enzyme
Mol. Mass.:
39456.00
Organism:
Homo sapiens (Human)
Description:
Catalytic domain of human cloned isozyme was used in the assay
Residue:
354
  
Inhibitor
Name:
BDBM50098350
Synonyms:
CHEMBL3594422
Type:
Small organic molecule
Emp. Form.:
C22H24N8O4S6
Mol. Mass.:
656.867
SMILES:
CS\C(=N/c1nc2ccc(cc2s1)S(N)(=O)=O)N1CCN(CC1)C(\SC)=N\c1nc2ccc(cc2s1)S(N)(=O)=O
: