Target
Vitamin K-dependent protein C
Ligand
BDBM50098599
Substrate
Meas. Tech.
ChEMBL_1504786 (CHEMBL3595071)
Ki
1300±n/a nM
Citation
 Priestley, ESCheney, DLDeLucca, IWei, ALuettgen, JMRendina, ARWong, PCWexler, RR Structure-Based Design of Macrocyclic Coagulation Factor VIIa Inhibitors. J Med Chem 58:6225-36 (2015)  
Target
Name:
Vitamin K-dependent protein C
Synonyms:
Activated protein C cofactor Apolipoprotein H Blood coagulation factor XIV Coagulation factor V heavy chain Endothelial protein C receptor PROC_HUMAN Vitamin K-dependent protein C precursor
Type:
Enzyme
Mol. Mass.:
52067.73
Organism:
Homo sapiens (Human)
Description:
Residue:
461
  
Inhibitor
Name:
BDBM50098599
Synonyms:
CHEMBL3594310
Type:
Small organic molecule
Emp. Form.:
C30H31N5O4S
Mol. Mass.:
557.663
SMILES:
CCS(=O)(=O)c1ccc2NC(=O)CCCc3ccc(cc3)[C@@H](Nc3ccc4c(N)nccc4c3)C(=O)NCc1c2
: