Target
Rap guanine nucleotide exchange factor 4
Ligand
BDBM50098719
Substrate
Meas. Tech.
ChEMBL_1504797 (CHEMBL3595150)
IC50
1900±n/a nM
Citation
 Ye, NZhu, YChen, HLiu, ZMei, FCWild, CChen, HCheng, XZhou, J Structure-Activity Relationship Studies of Substituted 2-(Isoxazol-3-yl)-2-oxo-N'-phenyl-acetohydrazonoyl Cyanide Analogues: Identification of Potent Exchange Proteins Directly Activated by cAMP (EPAC) Antagonists. J Med Chem 58:6033-47 (2015)  
Target
Name:
Rap guanine nucleotide exchange factor 4
Synonyms:
Cgef2 EPAC 2 Exchange factor directly activated by cAMP 2 RPGF4_MOUSE Rapgef4 cAMP-dependent Rap1 guanine-nucleotide exchange factor | cAMP-regulated guanine nucleotide exchange factor II
Type:
PROTEIN
Mol. Mass.:
115497.71
Organism:
Mus musculus
Description:
ChEMBL_109832
Residue:
1011
  
Inhibitor
Name:
BDBM50098719
Synonyms:
CHEMBL3593329
Type:
Small organic molecule
Emp. Form.:
C16H14Cl2N4O2
Mol. Mass.:
365.214
SMILES:
CC(C)(C)c1cc(no1)C(=O)C(=N\Nc1cc(Cl)cc(Cl)c1)\C#N
: