Target
Rap guanine nucleotide exchange factor 4
Ligand
BDBM50011360
Substrate
Meas. Tech.
ChEMBL_1504795 (CHEMBL3595148)
IC50
4400±n/a nM
Citation
 Ye, NZhu, YChen, HLiu, ZMei, FCWild, CChen, HCheng, XZhou, J Structure-Activity Relationship Studies of Substituted 2-(Isoxazol-3-yl)-2-oxo-N'-phenyl-acetohydrazonoyl Cyanide Analogues: Identification of Potent Exchange Proteins Directly Activated by cAMP (EPAC) Antagonists. J Med Chem 58:6033-47 (2015)  
Target
Name:
Rap guanine nucleotide exchange factor 4
Synonyms:
CGEF2 EPAC2 Exchange protein directly activated by cAMP 2 RPGF4_HUMAN cAMP-regulated guanine nucleotide exchange factor II
Type:
PROTEIN
Mol. Mass.:
115526.83
Organism:
Homo sapiens (Human)
Description:
ChEMBL_1504794
Residue:
1011
  
Inhibitor
Name:
BDBM50011360
Synonyms:
CHEMBL3260990
Type:
Small organic molecule
Emp. Form.:
C16H15ClN4O2
Mol. Mass.:
330.769
SMILES:
CC(C)(C)c1cc(no1)C(=O)C(=N\Nc1cccc(Cl)c1)\C#N
: