Target
Similar to alpha-tubulin isoform 1/Tubulin beta-2B chain
Ligand
BDBM50005480
Substrate
Meas. Tech.
ChEMBL_1504929 (CHEMBL3595578)
IC50
4900±n/a nM
Citation
 Lee, HYChang, CYLai, MJChuang, HYKuo, CCChang, CYChang, JYLiou, JP Antimitotic and antivascular activity of heteroaroyl-2-hydroxy-3,4,5-trimethoxybenzenes. Bioorg Med Chem 23:4230-6 (2015)  
Target
Name:
Similar to alpha-tubulin isoform 1/Tubulin beta-2B chain
Synonyms:
Tubulin | Tubulin alpha chain /beta chain
Type:
Mol. Mass.:
Description:
ASSAY_ID of EBI is 51441
Components:
This complex has 2 components.
Component 1
Name:
Tubulin beta-2B chain
Synonyms:
TBB2B_BOVIN Tubulin | Tubulin beta chain
Type:
PROTEIN
Mol. Mass.:
49932.38
Organism:
Bos taurus
Description:
ChEMBL_211651
Residue:
445
  
Component 2
Name:
Similar to alpha-tubulin isoform 1
Synonyms:
Tubulin
Type:
PROTEIN
Mol. Mass.:
9422.48
Organism:
Bos taurus
Description:
EBI_18002
Residue:
84
  
Inhibitor
Name:
BDBM50005480
Synonyms:
(-)-combretastatin (Z)-5-(3,4,5-trimethoxystyryl)-2-methoxyphenol (combretastin A-4)2-Methoxy-5-[2-(3,4,5-trimethoxy-phenyl)-vinyl]-phenol 2-Methoxy-5-[(Z)-2-(3,4,5-trimethoxy-phenyl)-vinyl]-phenol 2-methoxy-5-(3,4,5-trimethoxystyryl)phenol 5-(3,4,5-trimethoxystyryl)-2-methoxyphenol CHEMBL67 Combrestatin A4 Combretastatin Combretastin A-4 combretastatin A-4, (CSA4) | combretastin A4
Type:
Small organic molecule
Emp. Form.:
C18H20O5
Mol. Mass.:
316.3484
SMILES:
COc1ccc(\C=C/c2cc(OC)c(OC)c(OC)c2)cc1O
: