Target
Plasmepsin V
Ligand
BDBM50099247
Substrate
Meas. Tech.
ChEMBL_1459716 (CHEMBL3370434)
IC50
>20000±n/a nM
Citation
 Sleebs, BEGazdik, MO'Neill, MTRajasekaran, PLopaticki, SLackovic, KLowes, KSmith, BJCowman, AFBoddey, JA Transition state mimetics of the Plasmodium export element are potent inhibitors of Plasmepsin V from P. falciparum and P. vivax. J Med Chem 57:7644-62 (2014)  
Target
Name:
Plasmepsin V
Synonyms:
Plasmepsin V
Type:
PROTEIN
Mol. Mass.:
68485.65
Organism:
Plasmodium falciparum (isolate 3D7)
Description:
ChEMBL_109726
Residue:
590
  
Inhibitor
Name:
BDBM50099247
Synonyms:
CHEMBL3344161
Type:
Small organic molecule
Emp. Form.:
C33H52F3N7O8
Mol. Mass.:
731.8033
SMILES:
OC(=O)C(F)(F)F.CC[C@H](C)[C@H](NC(=O)[C@H](C)NC(=O)[C@H](CCCNC(N)=N)NC(=O)OCc1ccccc1)[C@@H](O)CC(=O)NC1CCCCC1
: