Target
Carbonic anhydrase 1
Ligand
BDBM60995
Substrate
Meas. Tech.
ChEMBL_1446410 (CHEMBL3375524)
Ki
700±n/a nM
Citation
 Del Prete, SVullo, DFisher, GMAndrews, KTPoulsen, SACapasso, CSupuran, CT Discovery of a new family of carbonic anhydrases in the malaria pathogen Plasmodium falciparum--theż-carbonic anhydrases. Bioorg Med Chem Lett 24:4389-96 (2014)  
Target
Name:
Carbonic anhydrase 1
Synonyms:
CA-I CAB Carbonate dehydratase I Carbonic anhydrase 1 (CA I) Carbonic anhydrase 1 (Recombinant CA I) Carbonic anhydrase B Carbonic anhydrase I (CA I) Carbonic anhydrase I (CAI) Carbonic anhydrase isoenzyme I (hCA I) | hCA
Type:
Enzyme
Mol. Mass.:
28873.37
Organism:
Homo sapiens (Human)
Description:
P00915
Residue:
261
  
Inhibitor
Name:
BDBM60995
Synonyms:
BDBM50401535 fulminate ion
Type:
Emp. Form.:
CNO
Mol. Mass.:
42.0173
SMILES:
[O-][N+]#[C-]
: