Target
Monoglyceride lipase
Ligand
BDBM50099613
Substrate
Meas. Tech.
ChEMBL_1432386 (CHEMBL3384491)
IC50
0.700000±n/a nM
Citation
 Korhonen, JKuusisto, Avan Bruchem, JPatel, JZLaitinen, TNavia-Paldanius, DLaitinen, JTSavinainen, JRParkkari, TNevalainen, TJ Piperazine and piperidine carboxamides and carbamates as inhibitors of fatty acid amide hydrolase (FAAH) and monoacylglycerol lipase (MAGL). Bioorg Med Chem 22:6694-705 (2014)  
Target
Name:
Monoglyceride lipase
Synonyms:
HU-K5 Lysophospholipase-like MGL MGLL_HUMAN
Type:
Hydrolase
Mol. Mass.:
33264.56
Organism:
Homo sapiens (Human)
Description:
Human recombinant MGL (Cayman Chemical, cat# 10008354).
Residue:
303
  
Inhibitor
Name:
BDBM50099613
Synonyms:
CHEMBL3356958
Type:
Small organic molecule
Emp. Form.:
C21H22N4O
Mol. Mass.:
346.4256
SMILES:
O=C(N1CCN(CC1)C(c1ccccc1)c1ccccc1)n1ccnc1
: