Target
Proteasome subunit beta type-9
Ligand
BDBM50099688
Substrate
Meas. Tech.
ChEMBL_1446809 (CHEMBL3371283)
IC50
6200±n/a nM
Citation
 de Bruin, GHuber, EMXin, BTvan Rooden, EJAl-Ayed, KKim, KBKisselev, AFDriessen, Cvan der Stelt, Mvan der Marel, GAGroll, MOverkleeft, HS Structure-based design of฿1i or฿5i specific inhibitors of human immunoproteasomes. J Med Chem 57:6197-209 (2014)  
Target
Name:
Proteasome subunit beta type-9
Synonyms:
LMP2 Macropain chain 7 PSB9_HUMAN PSMB9 Proteasome subunit beta-1i Really interesting new gene 12 protein
Type:
PROTEIN
Mol. Mass.:
23256.49
Organism:
Homo sapiens (Human)
Description:
ChEMBL_106197
Residue:
219
  
Inhibitor
Name:
BDBM50099688
Synonyms:
CHEMBL3319581
Type:
Small organic molecule
Emp. Form.:
C32H45N5O6
Mol. Mass.:
595.7296
SMILES:
C[C@@H](NC(=O)CN1CCOCC1)C(=O)N[C@@H](Cc1c[nH]c2ccccc12)C(=O)N[C@@H](CC1CCCCC1)C(=O)[C@@]1(C)CO1
: