Target
Proteasome subunit beta type-10
Ligand
BDBM50099688
Substrate
Meas. Tech.
ChEMBL_1446811 (CHEMBL3371285)
IC50
>10000±n/a nM
Citation
 de Bruin, GHuber, EMXin, BTvan Rooden, EJAl-Ayed, KKim, KBKisselev, AFDriessen, Cvan der Stelt, Mvan der Marel, GAGroll, MOverkleeft, HS Structure-based design of฿1i or฿5i specific inhibitors of human immunoproteasomes. J Med Chem 57:6197-209 (2014)  
Target
Name:
Proteasome subunit beta type-10
Synonyms:
LMP10 MECL1 Multicatalytic endopeptidase complex subunit MECl-1 PSMB10 Proteasome subunit beta-2i
Type:
PROTEIN
Mol. Mass.:
28940.51
Organism:
Homo sapiens (Human)
Description:
ChEMBL_106197
Residue:
273
  
Inhibitor
Name:
BDBM50099688
Synonyms:
CHEMBL3319581
Type:
Small organic molecule
Emp. Form.:
C32H45N5O6
Mol. Mass.:
595.7296
SMILES:
C[C@@H](NC(=O)CN1CCOCC1)C(=O)N[C@@H](Cc1c[nH]c2ccccc12)C(=O)N[C@@H](CC1CCCCC1)C(=O)[C@@]1(C)CO1
: