Target
Carboxylic ester hydrolase
Ligand
BDBM50100579
Substrate
Meas. Tech.
ChEMBL_1457647 (CHEMBL3368715)
IC50
35±n/a nM
Citation
 Li, YPeng, PTang, LHu, YHu, YSheng, R Design, synthesis and evaluation of rivastigmine and curcumin hybrids as site-activated multitarget-directed ligands for Alzheimer's disease therapy. Bioorg Med Chem 22:4717-25 (2014)  
Target
Name:
Carboxylic ester hydrolase
Synonyms:
Acetylcholinesterase and butyrylcholinesterase (AChE and BChE) Butyrylcholinesterase (BuChE) | butyrylcholinesterase precursor
Type:
Enzyme
Mol. Mass.:
67776.22
Organism:
Rattus norvegicus (rat)
Description:
Residue:
597
  
Inhibitor
Name:
BDBM50100579
Synonyms:
CHEMBL3321888
Type:
Small organic molecule
Emp. Form.:
C15H24N2O3
Mol. Mass.:
280.3627
SMILES:
CCN(CC)Cc1ccc(OC(=O)N(C)C)c(OC)c1
: