Target
Nociceptin receptor
Ligand
BDBM50100982
Substrate
Meas. Tech.
ChEMBL_1452450 (CHEMBL3362474)
Ki
2.0±n/a nM
Citation
 Schunk, SLinz, KFrormann, SHinze, COberbörsch, SSundermann, BZemolka, SEnglberger, WGermann, TChristoph, TKögel, BYSchröder, WHarlfinger, SSaunders, DKless, ASchick, HSonnenschein, H Discovery of Spiro[cyclohexane-dihydropyrano[3,4-b]indole]-amines as Potent NOP and Opioid Receptor Agonists. ACS Med Chem Lett 5:851-6 (2014)  
Target
Name:
Nociceptin receptor
Synonyms:
KOR-3 Mu-type opioid receptor (Mu) Nociceptin Receptor (ORL1 Receptor) Nociceptin receptor (ORL-1) Nociceptin/Orphanin FQ, NOP receptor OPIATE ORL-1 OPRL1 protein ORL1 Opioid receptor like-1 Orphanin FQ receptor (ORL1) | P41146
Type:
G Protein-Coupled Receptor (GPCR)
Mol. Mass.:
40702.87
Organism:
Homo sapiens (Human)
Description:
P41146
Residue:
370
  
Inhibitor
Name:
BDBM50100982
Synonyms:
CHEMBL3326225
Type:
Small organic molecule
Emp. Form.:
C24H30N2O
Mol. Mass.:
362.5078
SMILES:
CN(C)[C@]1(CC[C@@H](CC1)OCCc1c[nH]c2ccccc12)c1ccccc1
: