Target
Nociceptin receptor
Ligand
BDBM50101091
Substrate
Meas. Tech.
ChEMBL_1452449 (CHEMBL3362473)
Ki
0.400000±n/a nM
Citation
 Schunk, SLinz, KFrormann, SHinze, COberbörsch, SSundermann, BZemolka, SEnglberger, WGermann, TChristoph, TKögel, BYSchröder, WHarlfinger, SSaunders, DKless, ASchick, HSonnenschein, H Discovery of Spiro[cyclohexane-dihydropyrano[3,4-b]indole]-amines as Potent NOP and Opioid Receptor Agonists. ACS Med Chem Lett 5:851-6 (2014)  
Target
Name:
Nociceptin receptor
Synonyms:
KOR-3 Mu-type opioid receptor (Mu) Nociceptin Receptor (ORL1 Receptor) Nociceptin receptor (ORL-1) Nociceptin/Orphanin FQ, NOP receptor OPIATE ORL-1 OPRL1 protein ORL1 Opioid receptor like-1 Orphanin FQ receptor (ORL1) | P41146
Type:
G Protein-Coupled Receptor (GPCR)
Mol. Mass.:
40702.87
Organism:
Homo sapiens (Human)
Description:
P41146
Residue:
370
  
Inhibitor
Name:
BDBM50101091
Synonyms:
CHEMBL3326223
Type:
Small organic molecule
Emp. Form.:
C24H32Cl2FN3
Mol. Mass.:
452.435
SMILES:
Cl.Cl.CN(C)[C@]1(CC[C@@H](CC1)NCCc1c[nH]c2ccc(F)cc12)c1ccccc1
: