Target
Histone deacetylase 11
Ligand
BDBM50354086
Substrate
Meas. Tech.
ChEMBL_1455104 (CHEMBL3366360)
IC50
0.300000±n/a nM
Citation
 Salvador, LAPark, HAl-Awadhi, FHLiu, YKim, BZeller, SLChen, QYHong, JLuesch, H Modulation of Activity Profiles for Largazole-Based HDAC Inhibitors through Alteration of Prodrug Properties. ACS Med Chem Lett 5:905-10 (2014)  
Target
Name:
Histone deacetylase 11
Synonyms:
HD11 HDAC11 | Human HDAC11
Type:
Chromatin regulator; hydrolase; repressor
Mol. Mass.:
39187.66
Organism:
Homo sapiens (Human)
Description:
Q96DB2
Residue:
347
  
Inhibitor
Name:
BDBM50354086
Synonyms:
FK-228 ROMIDEPSIN
Type:
Small organic molecule
Emp. Form.:
C25H39N3O6S2
Mol. Mass.:
541.724
SMILES:
C\C=C1/NC(=O)[C@@H](CS)NC(=O)[C@H](CC(=O)C[C@H](OC(=O)[C@@H](NC1=O)C(C)C)\C=C\CCS)C(C)C
: