Target
Lysosomal acid glucosylceramidase
Ligand
BDBM50101399
Substrate
Meas. Tech.
ChEMBL_1460503 (CHEMBL3395305)
pH
7.3±n/a
Ki
11800±n/a nM
Comments
extracted
Citation
 Castilla, JRísquez, RHigaki, KNanba, EOhno, KSuzuki, YDíaz, YOrtiz Mellet, CGarcía Fernández, JMCastillón, S Conformationally-locked N-glycosides: exploiting long-range non-glycone interactions in the design of pharmacological chaperones for Gaucher disease. Eur J Med Chem 90:258-66 (2015)  
Target
Name:
Lysosomal acid glucosylceramidase
Synonyms:
Acid beta-glucosidase GBA GBA1_BOVIN | Glucosylceramidase
Type:
PROTEIN
Mol. Mass.:
59862.93
Organism:
Bos taurus
Description:
ChEMBL_1460504
Residue:
536
  
Inhibitor
Name:
BDBM50101399
Synonyms:
CHEMBL3393929
Type:
Small organic molecule
Emp. Form.:
C30H52N2O10S2
Mol. Mass.:
664.871
SMILES:
[H][C@]12OC(SCCCCCCCCCCCCCCCCSC3=N[C@@]4([H])O[C@H](CO)[C@@H](O)[C@H](O)[C@@]4([H])O3)=N[C@@]1([H])O[C@H](CO)[C@@H](O)[C@@H]2O
: