Target
ALK tyrosine kinase receptor
Ligand
BDBM50101805
Substrate
Meas. Tech.
ChEMBL_1463523 (CHEMBL3398705)
IC50
3.0±n/a nM
Citation
 Mesaros, EFAngeles, TSAlbom, MSWagner, JCAimone, LDWan, WLu, LHuang, ZOlsen, MKordwitz, EHaltiwanger, RCLandis, AJCheng, MRuggeri, BAAtor, MADorsey, BDOtt, GR Piperidine-3,4-diol and piperidine-3-ol derivatives of pyrrolo[2,1-f][1,2,4]triazine as inhibitors of anaplastic lymphoma kinase. Bioorg Med Chem Lett 25:1047-52 (2015)  
Target
Name:
ALK tyrosine kinase receptor
Synonyms:
ALK ALK_HUMAN CD_antigen: CD246
Type:
Protein
Mol. Mass.:
176453.10
Organism:
Homo sapiens (Human)
Description:
Q9UM73
Residue:
1620
  
Inhibitor
Name:
BDBM50101805
Synonyms:
CHEMBL3398172
Type:
Small organic molecule
Emp. Form.:
C26H29N5O3
Mol. Mass.:
459.5402
SMILES:
COc1cc(ccc1Nc1ncc2ccc(-c3ccccc3OC)n2n1)C1CCN(C)CC1O
: