Target
Cytochrome P450 2A6
Ligand
BDBM109750
Substrate
Meas. Tech.
ChEMBL_1486536 (CHEMBL3532205)
Kd
71000±n/a nM
Citation
 Stephens, ESWalsh, AAScott, EE Evaluation of inhibition selectivity for human cytochrome P450 2A enzymes. Drug Metab Dispos 40:1797-802 (2012)  
Target
Name:
Cytochrome P450 2A6
Synonyms:
1,4-cineole 2-exo-monooxygenase CP2A6_HUMAN CYP2A6 Coumarin 7-hydroxylase Cytochrome P450 IIA3 | Cytochrome P450(I)
Type:
Protein
Mol. Mass.:
56514.34
Organism:
Homo sapiens (Human)
Description:
P11509
Residue:
494
  
Inhibitor
Name:
BDBM109750
Synonyms:
US8609708, 19 β-Nicotyrine | US8609708, 19 beat-Nicotyrine
Type:
Small organic molecule
Emp. Form.:
C10H10N2
Mol. Mass.:
158.1998
SMILES:
Cn1cccc1-c1cccnc1
: