Target
Glutamate receptor ionotropic, kainate 3
Ligand
BDBM50355329
Substrate
Meas. Tech.
ChEMBL_1447327 (CHEMBL3379751)
Ki
14400±n/a nM
Citation
 Sköld, NNielsen, BOlsen, JHan, LOlsen, LMadsen, UKristensen, JLPickering, DSJohansen, TN Design, synthesis and in vitro pharmacology of GluK1 and GluK3 antagonists. Studies towards the design of subtype-selective antagonists through 2-carboxyethyl-phenylalanines with substituents interacting with non-conserved residues in the GluK binding sites. Bioorg Med Chem 22:5368-77 (2014)  
Target
Name:
Glutamate receptor ionotropic, kainate 3
Synonyms:
GRIK3_RAT Glutamate receptor ionotropic kainate 3 Grik3
Type:
PROTEIN
Mol. Mass.:
104080.46
Organism:
Rattus norvegicus
Description:
ChEMBL_1447329
Residue:
919
  
Inhibitor
Name:
BDBM50355329
Synonyms:
CHEMBL1835336
Type:
Small organic molecule
Emp. Form.:
C12H13ClN2O6
Mol. Mass.:
316.694
SMILES:
NC(Cc1cc(Cl)c(cc1CCC(O)=O)[N+]([O-])=O)C(O)=O
: