Target
Mitogen-activated protein kinase 8
Ligand
BDBM50102618
Substrate
Meas. Tech.
ChEMBL_1441443 (CHEMBL3373992)
IC50
2800±n/a nM
Citation
 Doma, AKulkarni, RPalakodety, RSastry, GNSridhara, JGarlapati, A Pyrazole derivatives as potent inhibitors of c-Jun N-terminal kinase: synthesis and SAR studies. Bioorg Med Chem 22:6209-19 (2014)  
Target
Name:
Mitogen-activated protein kinase 8
Synonyms:
JNK-46 JNK1-alpha-1 MK08_HUMAN PRKM8 SAPK1C c-Jun N-terminal kinase 1 c-Jun N-terminal kinase 1(JNK1) | c-Jun N-terminal kinase 2 (JNK2)
Type:
Enzyme
Mol. Mass.:
48297.57
Organism:
Homo sapiens (Human)
Description:
JNK-1 was purchased from Upstate Cell Signaling Solutions (formerly Upstate Biotechnology).
Residue:
427
  
Inhibitor
Name:
BDBM50102618
Synonyms:
CHEMBL3342921
Type:
Small organic molecule
Emp. Form.:
C15H13N3O2
Mol. Mass.:
267.2826
SMILES:
O=C(NCc1ccco1)c1cc([nH]n1)-c1ccccc1
: