Target
Bifunctional protein GlmU
Ligand
BDBM50102663
Substrate
Meas. Tech.
ChEMBL_1443091 (CHEMBL3380797)
IC50
35000±n/a nM
Citation
 Doig, PBoriack-Sjodin, PADumas, JHu, JItoh, KJohnson, KKazmirski, SKinoshita, TKuroda, SSato, TOSugimoto, KTohyama, KAoi, HWakamatsu, KWang, H Rational design of inhibitors of the bacterial cell wall synthetic enzyme GlmU using virtual screening and lead-hopping. Bioorg Med Chem 22:6256-69 (2014)  
Target
Name:
Bifunctional protein GlmU
Synonyms:
Bifunctional protein (GlmU) Glucosamine-1-phosphate N-acetyltransferase glmU | yieA
Type:
Enzyme
Mol. Mass.:
49189.50
Organism:
Escherichia coli
Description:
P0ACC7
Residue:
456
  
Inhibitor
Name:
BDBM50102663
Synonyms:
CHEMBL3343037
Type:
Small organic molecule
Emp. Form.:
C24H22N4O4
Mol. Mass.:
430.4559
SMILES:
COc1cc2c(Nc3ccc(NC(=O)c4ccccc4)cc3)ncnc2cc1OCCO
: