Target
Interleukin-1 receptor-associated kinase 1
Ligand
BDBM50102677
Substrate
Meas. Tech.
ChEMBL_1443096 (CHEMBL3380802)
IC50
>30000±n/a nM
Citation
 Doig, PBoriack-Sjodin, PADumas, JHu, JItoh, KJohnson, KKazmirski, SKinoshita, TKuroda, SSato, TOSugimoto, KTohyama, KAoi, HWakamatsu, KWang, H Rational design of inhibitors of the bacterial cell wall synthetic enzyme GlmU using virtual screening and lead-hopping. Bioorg Med Chem 22:6256-69 (2014)  
Target
Name:
Interleukin-1 receptor-associated kinase 1
Synonyms:
IRAK IRAK1 Interleukin-1 receptor-associated kinase 1 (IRAK-1)
Type:
Enzyme
Mol. Mass.:
76536.81
Organism:
Homo sapiens (Human)
Description:
P51617
Residue:
712
  
Inhibitor
Name:
BDBM50102677
Synonyms:
CHEMBL3343057
Type:
Small organic molecule
Emp. Form.:
C24H25N5O5
Mol. Mass.:
463.4858
SMILES:
COc1cc(cc(c1)-c1c[nH]c(=O)[nH]c1=O)C(=O)Nc1ccc(NC(=O)C2CCCCN2)cc1
: