Target
Nociceptin receptor
Ligand
BDBM50102837
Substrate
Meas. Tech.
ChEMBL_1433282 (CHEMBL3389389)
IC50
1.4±n/a nM
Citation
 Inamine, SNishimura, HLi, JIsozaki, KMatsushima, ACosta, TShimohigashi, Y Tritium-labelled isovaleryl-RYYRIK-NH2 as potential antagonist probe for ORL1 nociceptin receptor. Bioorg Med Chem 22:5902-9 (2014)  
Target
Name:
Nociceptin receptor
Synonyms:
KOR-3 Mu-type opioid receptor (Mu) Nociceptin Receptor (ORL1 Receptor) Nociceptin receptor (ORL-1) Nociceptin/Orphanin FQ, NOP receptor OPIATE ORL-1 OPRL1 protein ORL1 Opioid receptor like-1 Orphanin FQ receptor (ORL1) | P41146
Type:
G Protein-Coupled Receptor (GPCR)
Mol. Mass.:
40702.87
Organism:
Homo sapiens (Human)
Description:
P41146
Residue:
370
  
Inhibitor
Name:
BDBM50102837
Synonyms:
CHEMBL3343948
Type:
Small organic molecule
Emp. Form.:
C45H72N14O9
Mol. Mass.:
953.1416
SMILES:
CC[C@H](C)[C@H](NC(=O)[C@H](CCCNC(N)=N)NC(=O)[C@H](Cc1ccc(O)cc1)NC(=O)[C@H](Cc1ccc(O)cc1)NC(=O)[C@H](CCCNC(N)=N)NC(=O)CC)C(=O)N[C@@H](CCCCN)C(N)=O
: