Target
Prostacyclin receptor
Ligand
BDBM50103391
Substrate
Meas. Tech.
ChEMBL_1463664 (CHEMBL3399051)
IC50
330±n/a nM
Citation
 Tran, TAShin, YJKramer, BChoi, JZou, NVallar, PMartens, PBoatman, PDAdams, JWRamirez, JShi, YMorgan, MUnett, DJChang, SShu, HHTung, SFSemple, G Discovery of a new series of potent prostacyclin receptor agonists with in vivo activity in rat. Bioorg Med Chem Lett 25:1030-5 (2015)  
Target
Name:
Prostacyclin receptor
Synonyms:
PGI receptor PRIPR Prostacyclin (IP) Receptor Prostaglandin I Prostaglandin I2 receptor | Prostanoid IP receptor
Type:
G Protein-Coupled Receptor (GPCR)
Mol. Mass.:
40968.22
Organism:
Homo sapiens (Human)
Description:
The membranes prepared from human platelet were used in binding assay.
Residue:
386
  
Inhibitor
Name:
BDBM50103391
Synonyms:
CHEMBL3398233
Type:
Small organic molecule
Emp. Form.:
C30H28N2O5
Mol. Mass.:
496.5537
SMILES:
COc1ccc(cc1)-c1c(cnn(CC2CCc3c(C2)cccc3OCC(O)=O)c1=O)-c1ccccc1
: