Target
Prostacyclin receptor
Ligand
BDBM50103408
Substrate
Meas. Tech.
ChEMBL_1463661 (CHEMBL3399048)
EC50
28±n/a nM
Citation
 Tran, TAShin, YJKramer, BChoi, JZou, NVallar, PMartens, PBoatman, PDAdams, JWRamirez, JShi, YMorgan, MUnett, DJChang, SShu, HHTung, SFSemple, G Discovery of a new series of potent prostacyclin receptor agonists with in vivo activity in rat. Bioorg Med Chem Lett 25:1030-5 (2015)  
Target
Name:
Prostacyclin receptor
Synonyms:
PI2R_RAT Prostaglandin I2 | Ptgir
Type:
Enzyme Catalytic Domain
Mol. Mass.:
44673.87
Organism:
RAT
Description:
Prostaglandin I2 PTGIR RAT::P43253
Residue:
416
  
Inhibitor
Name:
BDBM50103408
Synonyms:
CHEMBL3398220
Type:
Small organic molecule
Emp. Form.:
C31H30N2O5
Mol. Mass.:
510.5803
SMILES:
COc1cccc(c1)-c1cc(=O)n(CC2CCc3c(C2)cccc3OCC(O)=O)nc1-c1ccc(C)cc1
: