Target
Prostacyclin receptor
Ligand
BDBM50103418
Substrate
Meas. Tech.
ChEMBL_1463661 (CHEMBL3399048)
EC50
>3000±n/a nM
Citation
 Tran, TAShin, YJKramer, BChoi, JZou, NVallar, PMartens, PBoatman, PDAdams, JWRamirez, JShi, YMorgan, MUnett, DJChang, SShu, HHTung, SFSemple, G Discovery of a new series of potent prostacyclin receptor agonists with in vivo activity in rat. Bioorg Med Chem Lett 25:1030-5 (2015)  
Target
Name:
Prostacyclin receptor
Synonyms:
PI2R_RAT Prostaglandin I2 | Ptgir
Type:
Enzyme Catalytic Domain
Mol. Mass.:
44673.87
Organism:
RAT
Description:
Prostaglandin I2 PTGIR RAT::P43253
Residue:
416
  
Inhibitor
Name:
BDBM50103418
Synonyms:
CHEMBL3398226
Type:
Small organic molecule
Emp. Form.:
C30H28N2O5
Mol. Mass.:
496.5537
SMILES:
COc1ccc(cc1)-c1cnn(CC2CCc3c(C2)cccc3OCC(O)=O)c(=O)c1-c1ccccc1
: