Target
Transient receptor potential cation channel subfamily A member 1
Ligand
BDBM50203072
Substrate
Meas. Tech.
ChEMBL_1462473 (CHEMBL3398876)
EC50
2000±n/a nM
Citation
 Del Prete, DCaprioglio, DAppendino, GMinassi, ASchiano-Moriello, ADi Marzo, VDe Petrocellis, L Discovery of non-electrophilic capsaicinoid-type TRPA1 ligands. Bioorg Med Chem Lett 25:1009-11 (2015)  
Target
Name:
Transient receptor potential cation channel subfamily A member 1
Synonyms:
Anktm1 Trpa1
Type:
PROTEIN
Mol. Mass.:
128622.74
Organism:
Rattus norvegicus
Description:
ChEMBL_1450487
Residue:
1125
  
Inhibitor
Name:
BDBM50203072
Synonyms:
3-isothiocyanatoprop-1-ene Allylisothiocyanate | CHEMBL233248
Type:
Small organic molecule
Emp. Form.:
C4H5NS
Mol. Mass.:
99.154
SMILES:
C=CCN=C=S
: