Target
Tyrosine-protein phosphatase non-receptor type 5
Ligand
BDBM50103445
Substrate
Meas. Tech.
ChEMBL_1462478 (CHEMBL3398881)
Ki
109±n/a nM
Citation
 Baguley, TDNairn, ACLombroso, PJEllman, JA Synthesis of benzopentathiepin analogs and their evaluation as inhibitors of the phosphatase STEP. Bioorg Med Chem Lett 25:1044-6 (2015)  
Target
Name:
Tyrosine-protein phosphatase non-receptor type 5
Synonyms:
PTN5_HUMAN Tyrosine-protein phosphatase non-receptor type 5 | Tyrosine-protein phosphatase non-receptor type 5 isoform a
Type:
Enzyme Catalytic Domain
Mol. Mass.:
63510.68
Organism:
Homo sapiens (Human)
Description:
gi_90652859
Residue:
565
  
Inhibitor
Name:
BDBM50103445
Synonyms:
CHEMBL3398243
Type:
Small organic molecule
Emp. Form.:
C7H3F3S5
Mol. Mass.:
304.419
SMILES:
FC(F)(F)c1ccc2SSSSSc2c1
: