Target
Solute carrier family 22 member 8
Ligand
BDBM50350471
Substrate
Meas. Tech.
ChEMBL_1482571 (CHEMBL3537392)
IC50
105000±n/a nM
Citation
 Wolman, ATGionfriddo, MRHeindel, GAMukhija, PWitkowski, SBommareddy, AVanwert, AL Organic anion transporter 3 interacts selectively with lipophilicß-lactam antibiotics. Drug Metab Dispos 41:791-800 (2013)  
Target
Name:
Solute carrier family 22 member 8
Synonyms:
Oat3 Organic anion transporter 3 Roct Slc22a8 mOat3
Type:
PROTEIN
Mol. Mass.:
59254.18
Organism:
Mus musculus
Description:
ChEMBL_104613
Residue:
537
  
Inhibitor
Name:
BDBM50350471
Synonyms:
CEFMETAZOLE
Type:
Small organic molecule
Emp. Form.:
C15H17N7O5S3
Mol. Mass.:
471.534
SMILES:
CO[C@]1(NC(=O)CSCC#N)[C@H]2SCC(CSc3nnnn3C)=C(N2C1=O)C(O)=O
: