Target
Cytochrome P450 2C8
Ligand
BDBM50070208
Substrate
Meas. Tech.
ChEMBL_1493770 (CHEMBL3530853)
IC50
5750±n/a nM
Citation
 Lee, CAJones, JPKatayama, JKaspera, RJiang, YFreiwald, SSmith, EWalker, GSTotah, RA Identifying a selective substrate and inhibitor pair for the evaluation of CYP2J2 activity. Drug Metab Dispos 40:943-51 (2012)  
Target
Name:
Cytochrome P450 2C8
Synonyms:
CP2C8_HUMAN CYPIIC8 P450 IIC2 P450 form 1 | S-mephenytoin 4-hydroxylase
Type:
Protein
Mol. Mass.:
55839.23
Organism:
Homo sapiens (Human)
Description:
P10632
Residue:
490
  
Inhibitor
Name:
BDBM50070208
Synonyms:
A-65006 CHEBI:6375 Prevacid Prevacid Delayed Release Prevacid iv
Type:
Small organic molecule
Emp. Form.:
C16H14F3N3O2S
Mol. Mass.:
369.361
SMILES:
Cc1c(OCC(F)(F)F)ccnc1C[S+]([O-])c1nc2ccccc2[nH]1
: