Target
Cytochrome P450 2C8
Ligand
BDBM50436176
Substrate
Meas. Tech.
ChEMBL_1493770 (CHEMBL3530853)
IC50
5000±n/a nM
Citation
 Lee, CAJones, JPKatayama, JKaspera, RJiang, YFreiwald, SSmith, EWalker, GSTotah, RA Identifying a selective substrate and inhibitor pair for the evaluation of CYP2J2 activity. Drug Metab Dispos 40:943-51 (2012)  
Target
Name:
Cytochrome P450 2C8
Synonyms:
CP2C8_HUMAN CYPIIC8 P450 IIC2 P450 form 1 | S-mephenytoin 4-hydroxylase
Type:
Protein
Mol. Mass.:
55839.23
Organism:
Homo sapiens (Human)
Description:
P10632
Residue:
490
  
Inhibitor
Name:
BDBM50436176
Synonyms:
Dynacirc ISRADIPINE PN-200-110
Type:
Small organic molecule
Emp. Form.:
C19H21N3O5
Mol. Mass.:
371.3871
SMILES:
COC(=O)C1=C(C)NC(C)=C(C1c1cccc2nonc12)C(=O)OC(C)C
: