Target
Cytochrome P450 2J2
Ligand
BDBM78577
Substrate
Meas. Tech.
ChEMBL_1485701 (CHEMBL3541093)
IC50
11500±n/a nM
Citation
 Ren, SZeng, JMei, YZhang, JZYan, SFFei, JChen, L Discovery and characterization of novel, potent, and selective cytochrome P450 2J2 inhibitors. Drug Metab Dispos 41:60-71 (2012)  
Target
Name:
Cytochrome P450 2J2
Synonyms:
CP2J2_HUMAN | CYP2J2
Type:
Enzyme
Mol. Mass.:
57623.04
Organism:
Homo sapiens (Human)
Description:
P51589
Residue:
502
  
Inhibitor
Name:
BDBM78577
Synonyms:
BEPRIDIL HYDROCHLORIDE MLS000028456 N-[3-(2-methylpropoxy)-2-pyrrolidin-1-yl-propyl]-N-(phenylmethyl)aniline;hydrochloride SMR000058419 cid_50088
Type:
Small organic molecule
Emp. Form.:
C24H34N2O
Mol. Mass.:
366.5396
SMILES:
CC(C)COCC(CN(Cc1ccccc1)c1ccccc1)N1CCCC1
: