Target
Potassium voltage-gated channel subfamily E member 1
Ligand
BDBM50103543
Substrate
Meas. Tech.
ChEMBL_1434849 (CHEMBL3384646)
IC50
27000±n/a nM
Citation
 Scott, JSBowker, SSBrocklehurst, KJBrown, HSClarke, DSEaster, AErtan, AGoldberg, KHudson, JAKavanagh, SLaber, DLeach, AGMacFaul, PAMartin, EAMcKerrecher, DSchofield, PSvensson, PHTeague, J Circumventing seizure activity in a series of G protein coupled receptor 119 (GPR119) agonists. J Med Chem 57:8984-98 (2014)  
Target
Name:
Potassium voltage-gated channel subfamily E member 1
Synonyms:
Delayed rectifier potassium channel subunit IsK KCNE1 KCNQ1(Kv7.1)/KCNE1(MinK) Voltage-gated potassium channel beta subunit Mink | Voltage-gated potassium channel, IKs
Type:
PROTEIN
Mol. Mass.:
14676.11
Organism:
Homo sapiens (Human)
Description:
ChEMBL_1456351
Residue:
129
  
Inhibitor
Name:
BDBM50103543
Synonyms:
CHEMBL3358006
Type:
Small organic molecule
Emp. Form.:
C21H22F4N6O4S
Mol. Mass.:
530.496
SMILES:
C[C@@H]1CN(CCN1c1ncc(OCc2ccc(CS(C)(=O)=O)cc2F)cn1)c1nc(no1)C(F)(F)F
: