Target
Histone deacetylase 6
Ligand
BDBM50103602
Substrate
Meas. Tech.
ChEMBL_1484272 (CHEMBL3538488)
IC50
1100±n/a nM
Citation
 Fredenhagen, AKittelmann, MOberer, LKuhn, AKühnöl, JDélémonté, TAichholz, RWang, PAtadja, PShultz, MD Biocatalytic synthesis and structure elucidation of cyclized metabolites of the deacetylase inhibitor panobinostat (LBH589). Drug Metab Dispos 40:1041-50 (2012)  
Target
Name:
Histone deacetylase 6
Synonyms:
Cereblon/Histone deacetylase 6 HDAC6 Histone deacetylase 6 (HDAC6) KIAA0901 | ORF Names:JM21
Type:
Chromatin regulator; hydrolase; repressor
Mol. Mass.:
131381.51
Organism:
Homo sapiens (Human)
Description:
Q9UBN7
Residue:
1215
  
Inhibitor
Name:
BDBM50103602
Synonyms:
CHEMBL3526396
Type:
Small organic molecule
Emp. Form.:
C21H23N3O2
Mol. Mass.:
349.4262
SMILES:
C[C@@]12Nc3ccccc3[C@]1(O)CCN2Cc1ccc(\C=C\C(N)=O)cc1
: