Target
Histone deacetylase 4
Ligand
BDBM50103603
Substrate
Meas. Tech.
ChEMBL_1484271 (CHEMBL3538487)
IC50
4600±n/a nM
Citation
 Fredenhagen, AKittelmann, MOberer, LKuhn, AKühnöl, JDélémonté, TAichholz, RWang, PAtadja, PShultz, MD Biocatalytic synthesis and structure elucidation of cyclized metabolites of the deacetylase inhibitor panobinostat (LBH589). Drug Metab Dispos 40:1041-50 (2012)  
Target
Name:
Histone deacetylase 4
Synonyms:
Cereblon/Histone deacetylase 4 HDAC4 Histone acetylase 4(HDAC4) KIAA0288
Type:
Enzyme
Mol. Mass.:
119049.39
Organism:
Homo sapiens (Human)
Description:
P56524
Residue:
1084
  
Inhibitor
Name:
BDBM50103603
Synonyms:
CHEMBL3526942
Type:
Small organic molecule
Emp. Form.:
C21H23N3O2
Mol. Mass.:
349.4262
SMILES:
Cc1[nH]c2cc(O)ccc2c1CCNCc1ccc(\C=C\C(N)=O)cc1
: