Target
Histone deacetylase 8
Ligand
BDBM50103604
Substrate
Meas. Tech.
ChEMBL_1484273 (CHEMBL3538489)
IC50
920±n/a nM
Citation
 Fredenhagen, AKittelmann, MOberer, LKuhn, AKühnöl, JDélémonté, TAichholz, RWang, PAtadja, PShultz, MD Biocatalytic synthesis and structure elucidation of cyclized metabolites of the deacetylase inhibitor panobinostat (LBH589). Drug Metab Dispos 40:1041-50 (2012)  
Target
Name:
Histone deacetylase 8
Synonyms:
HD8 HDAC8_HUMAN Histone deacetylase 8 (HDAC-8) | Human HDAC8
Type:
Enzyme
Mol. Mass.:
41749.60
Organism:
Homo sapiens (Human)
Description:
Q9BY41
Residue:
377
  
Inhibitor
Name:
BDBM50103604
Synonyms:
CHEMBL3526395
Type:
Small organic molecule
Emp. Form.:
C21H23N3O3
Mol. Mass.:
365.4256
SMILES:
C[C@@]12Nc3ccccc3[C@]1(O)CCN2Cc1ccc(\C=C\C(=O)NO)cc1
: